Reaction Details
TargetSerine/threonine-protein kinase pim-1
LigandBDBM104065
Substrate/Competitorn/a
Meas. Tech.Kinome Profiling
IC50 1700±0.0 nM
Citation Carlson, DAFranke, ASWeitzel, DHSpeer, BLHughes, PFHagerty, LFortner, CNVeal, JMBarta, TEZieba, BJSomlyo, AVSutherland, CDeng, JTWalsh, MPMacdonald, JAHaystead, TA Fluorescence Linked Enzyme Chemoproteomic Strategy for Discovery of a Potent and Selective DAPK1 and ZIPK Inhibitor. ACS Chem Biol8:2715-23 (2013) 
 
Serine/threonine-protein kinase pim-1
Name:Serine/threonine-protein kinase pim-1
Type:Protein
Mol. Mass.:35681.82
Organism:Homo sapiens (Human)
Description:P11309
Residue:313
BDBM104065
NameBDBM104065
Synonyms:HS38
TypeSmall organic molecule
Emp. Form.C14H12ClN5O2S
Mol. Mass.349.795
SMILESCC(Sc1nc2n(ncc2c(=O)[nH]1)-c1cccc(Cl)c1)C(N)=O