Reaction Details
TargetHIV WT-A pol protein (wild-type clade A)
LigandBDBM577
Substrate/Competitorn/a
Meas. Tech.Drug Susceptibility Assay
EC50 2.6±0.0 nM
Citation Shen, YAltman, MDAli, ANalam, MNCao, HRana, TMSchiffer, CATidor, B Testing the substrate-envelope hypothesis with designed pairs of compounds. ACS Chem Biol8:2433-41 (2013) 
 
HIV WT-A pol protein (wild-type clade A)
Name:HIV WT-A pol protein (wild-type clade A)
Type:Protein
Mol. Mass.:45854.50
Organism:Human immunodeficiency virus
Description:P12497[489-892,I502V,E524D,M525I,R530K,H558K,L578M,K599T,V609I,V623T,T627K,Q690K,C750S,T753I,K761S,D765E,V767I,T788A,I790V,Q795A,V833Q,E836D,A860P,R865K,K869R,T874A,E879D]
Residue:404
BDBM577
NameBDBM577
Synonyms:(3S)-oxolan-3-yl N-[(2S,3R)-4-[(4-aminobenzene)(2-methylpropyl)sulfonamido]-3-hydroxy-1-phenylbutan-2-yl]carbamate APV Amprenavir CHEMBL116 | VX-478
TypeSmall organic molecule
Emp. Form.C25H35N3O6S
Mol. Mass.505.627
SMILESCC(C)CN(C[C@@H](O)[C@H](Cc1ccccc1)NC(=O)O[C@H]1CCOC1)S(=O)(=O)c1ccc(N)cc1