Reaction Details
TargetGag-Pol polyprotein [489-892,N526H,R530K,V566I,I582L,V648I,Q690K,I723V,C750S,T788A,Q795E,T874A,V881I,P882Q]
LigandBDBM577
Substrate/Competitorn/a
Meas. Tech.Drug Susceptibility Assay
EC50 1.8±0.0 nM
Citation Shen, YAltman, MDAli, ANalam, MNCao, HRana, TMSchiffer, CATidor, B Testing the substrate-envelope hypothesis with designed pairs of compounds. ACS Chem Biol8:2433-41 (2013) 
 
Gag-Pol polyprotein [489-892,N526H,R530K,V566I,I582L,V648I,Q690K,I723V,C750S,T788A,Q795E,T874A,V881I,P882Q]
Name:Gag-Pol polyprotein [489-892,N526H,R530K,V566I,I582L,V648I,Q690K,I723V,C750S,T788A,Q795E,T874A,V881I,P882Q]
Type:Protein
Mol. Mass.:46017.68
Organism:Human immunodeficiency virus
Description:P12497[489-892,N526H,R530K,V566I,I582L,V648I,Q690K,I723V,C750S,T788A,Q795E,T874A,V881I,P882Q]
Residue:404
BDBM577
NameBDBM577
Synonyms:(3S)-oxolan-3-yl N-[(2S,3R)-4-[(4-aminobenzene)(2-methylpropyl)sulfonamido]-3-hydroxy-1-phenylbutan-2-yl]carbamate APV Amprenavir CHEMBL116 | VX-478
TypeSmall organic molecule
Emp. Form.C25H35N3O6S
Mol. Mass.505.627
SMILESCC(C)CN(C[C@@H](O)[C@H](Cc1ccccc1)NC(=O)O[C@H]1CCOC1)S(=O)(=O)c1ccc(N)cc1