Reaction Details
TargetGag-Pol polyprotein [489-892,N526H,R530K,V566I,I582L,V648I,Q690K,I723V,C750S,T788A,Q795E,T874A,V881I,P882Q]
LigandBDBM8125
Substrate/Competitorn/a
Meas. Tech.Drug Susceptibility Assay
EC50 0.15±0.0 nM
Citation Shen, YAltman, MDAli, ANalam, MNCao, HRana, TMSchiffer, CATidor, B Testing the substrate-envelope hypothesis with designed pairs of compounds. ACS Chem Biol8:2433-41 (2013) 
 
Gag-Pol polyprotein [489-892,N526H,R530K,V566I,I582L,V648I,Q690K,I723V,C750S,T788A,Q795E,T874A,V881I,P882Q]
Name:Gag-Pol polyprotein [489-892,N526H,R530K,V566I,I582L,V648I,Q690K,I723V,C750S,T788A,Q795E,T874A,V881I,P882Q]
Type:Protein
Mol. Mass.:46017.68
Organism:Human immunodeficiency virus
Description:P12497[489-892,N526H,R530K,V566I,I582L,V648I,Q690K,I723V,C750S,T788A,Q795E,T874A,V881I,P882Q]
Residue:404
BDBM8125
NameBDBM8125
Synonyms:(3R,3aS,6aR)-hexahydrofuro[2,3-b]furan-3-yl N-[(2S,3R)-4-[(4-aminobenzene)(2-methylpropyl)sulfonamido]-3-hydroxy-1-phenylbutan-2-yl]carbamate Darunavir TMC-114 US10806794, Compound Darunavir
TypeSmall organic molecule
Emp. Form.C27H37N3O7S
Mol. Mass.547.664
SMILES[H][C@@]1(CO[C@@]2([H])OCC[C@@]12[H])OC(=O)N[C@@H](Cc1ccccc1)[C@H](O)CN(CC(C)C)S(=O)(=O)c1ccc(N)cc1