Reaction Details
Target5-hydroxytryptamine receptor 6
LigandBDBM104378
Substrate/Competitorn/a
Meas. Tech.Binding Assay
Ki 0.29±0.0 nM
Citation Guzzo, PRHenderson, AJNacro, KIsherwood, MLGhosh, AXiang, K Epiminocycloalkyl[b] indole derivatives as serotonin sub-type 6 (5-HT6) modulators and uses thereof US Patent US8575186 Publication Date 11/5/2013
 
5-hydroxytryptamine receptor 6
Name:5-hydroxytryptamine receptor 6
Type:G Protein-Coupled Receptor (GPCR)
Mol. Mass.:46968.43
Organism:Homo sapiens (Human)
Description:P50406
Residue:440
BDBM104378
NameBDBM104378
Synonyms:US8575186, 141
TypeSmall organic molecule
Emp. Form.C23H22N2O2S2
Mol. Mass.422.563
SMILESCc1cc(cc2c3C4CCC(Cc3n(C)c12)N4)S(=O)(=O)c1csc2ccccc12