Reaction Details
Target5-hydroxytryptamine receptor 6
LigandBDBM104331
Substrate/Competitorn/a
Meas. Tech.Binding Assay
Ki 0.28±0.0 nM
Citation Guzzo, PRHenderson, AJNacro, KIsherwood, MLGhosh, AXiang, K Epiminocycloalkyl[b] indole derivatives as serotonin sub-type 6 (5-HT6) modulators and uses thereof US Patent US8575186 Publication Date 11/5/2013
 
5-hydroxytryptamine receptor 6
Name:5-hydroxytryptamine receptor 6
Type:G Protein-Coupled Receptor (GPCR)
Mol. Mass.:46968.43
Organism:Homo sapiens (Human)
Description:P50406
Residue:440
BDBM104331
NameBDBM104331
Synonyms:US8575186, 177 US8575186, 94/161/162
TypeSmall organic molecule
Emp. Form.C22H21N3O2S
Mol. Mass.391.486
SMILESCn1c2CC3CCC(N3)c2c2cc(ccc12)S(=O)(=O)c1ccc2[nH]ccc2c1