Reaction Details
TargetOrexin receptor type 2
LigandBDBM104690
Substrate/Competitorn/a
Meas. Tech.Radioligand Binding Assay
Ki 0.54±0.0 nM
Citation Breslin, MJColeman, PJCox, CDSchreier, JD Pyridyl piperidine orexin receptor antagonists US Patent US8569311 Publication Date 10/29/2013
 
Orexin receptor type 2
Name:Orexin receptor type 2
Type:Protein
Mol. Mass.:52508.46
Organism:Rattus norvegicus (Rat)
Description:P56719
Residue:460
BDBM104690
NameBDBM104690
Synonyms:US8569311, B-3
TypeSmall organic molecule
Emp. Form.C24H25FN4O2
Mol. Mass.420.4793
SMILESC[C@@H]1CC[C@@H](COc2ccc(F)cn2)CN1C(=O)c1cc(C)ccc1-c1cnccn1