Reaction Details
TargetNeutrophil elastase
LigandBDBM104821
Substrate/Competitorn/a
Meas. Tech.Inhibition Assay
IC50<0.3±0.0 nM
Citation Von Nussbaum, FKarthaus, DAnlauf, SDelbeck, MLi, VMMeibom, DLustig, K Triazolo and tetrazolo pyrimidine derivatives as HNE inhibitors for treating COPD US Patent US8569314 Publication Date 10/29/2013
 
Neutrophil elastase
Name:Neutrophil elastase
Type:Enzyme
Mol. Mass.:28532.38
Organism:Homo sapiens (Human)
Description:P08246
Residue:267
BDBM104821
NameBDBM104821
Synonyms:US8569314, 9
TypeSmall organic molecule
Emp. Form.C22H16F3N7O2S
Mol. Mass.499.468
SMILESCC1=C([N+]#[C-])[C@@H](c2ccc(cc2S(C)(=O)=O)C#N)n2nc(N)nc2N1c1cccc(c1)C(F)(F)F