Reaction Details
TargetNeutrophil elastase
LigandBDBM104823
Substrate/Competitorn/a
Meas. Tech.Inhibition Assay
IC50<0.3±0.0 nM
Citation Von Nussbaum, FKarthaus, DAnlauf, SDelbeck, MLi, VMMeibom, DLustig, K Triazolo and tetrazolo pyrimidine derivatives as HNE inhibitors for treating COPD US Patent US8569314 Publication Date 10/29/2013
 
Neutrophil elastase
Name:Neutrophil elastase
Type:Enzyme
Mol. Mass.:28532.38
Organism:Homo sapiens (Human)
Description:P08246
Residue:267
BDBM104823
NameBDBM104823
Synonyms:US8569314, 35
TypeSmall organic molecule
Emp. Form.C26H20F3N7O3S
Mol. Mass.567.542
SMILESCC1=C([N+]#[C-])[C@@H](c2ccc(cc2S(C)(=O)=O)C#N)n2nc(NC(=O)C3CC3)nc2N1c1cccc(c1)C(F)(F)F