Reaction Details
TargetPolymerase acidic protein [1-204,T86I,G186S]
LigandBDBM50291683
Substrate/Competitorn/a
IC50 2e+3±n/a nM
Citation Bauman, JDPatel, DBaker, SFVijayan, RSXiang, AParhi, AKMartínez-Sobrido, LMartínez-Sobrido, EJDas, KArnold, E Crystallographic fragment screening and structure-based optimization yields a new class of influenza endonuclease inhibitors. ACS Chem Biol8:2501-8 (2013) 
 
Polymerase acidic protein [1-204,T86I,G186S]
Name:Polymerase acidic protein [1-204,T86I,G186S]
Type:Protein
Mol. Mass.:28455.35
Organism:2009 H1N1 Influenza
Description:P13166[1-204,T86I,G186S]
Residue:241
BDBM50291683
NameBDBM50291683
Synonyms:1-(3,4-Dihydroxy-benzyl)-2-methyl-1,2,3,4-tetrahydro-isoquinoline-6,7-diol D,L-laudanosoline (JW9-3)
TypeSmall organic molecule
Emp. Form.C17H19NO4
Mol. Mass.301.3371
SMILESCN1CCc2cc(O)c(O)cc2C1Cc1ccc(O)c(O)c1