Reaction Details
TargetPolymerase acidic protein [1-204,T86I,G186S]
LigandBDBM105195
Substrate/Competitorn/a
Meas. Tech.Fragment Screening
IC50>1.000e+6±n/a nM
Citation Bauman, JDPatel, DBaker, SFVijayan, RSXiang, AParhi, AKMartínez-Sobrido, LMartínez-Sobrido, EJDas, KArnold, E Crystallographic fragment screening and structure-based optimization yields a new class of influenza endonuclease inhibitors. ACS Chem Biol8:2501-8 (2013) 
 
Polymerase acidic protein [1-204,T86I,G186S]
Name:Polymerase acidic protein [1-204,T86I,G186S]
Type:Protein
Mol. Mass.:28455.35
Organism:2009 H1N1 Influenza
Description:P13166[1-204,T86I,G186S]
Residue:241
BDBM105195
NameBDBM105195
Synonyms:6-bromopyridin-3-amine | EN300-53250
TypeSmall organic molecule
Emp. Form.C5H5BrN2
Mol. Mass.173.011
SMILESNc1ccc(Br)nc1