Reaction Details
TargetPolymerase acidic protein [1-204,T86I,G186S]
LigandBDBM105201
Substrate/Competitorn/a
Meas. Tech.Fragment Screening
IC50 4.5e+2±n/a nM
Citation Bauman, JDPatel, DBaker, SFVijayan, RSXiang, AParhi, AKMartínez-Sobrido, LMartínez-Sobrido, EJDas, KArnold, E Crystallographic fragment screening and structure-based optimization yields a new class of influenza endonuclease inhibitors. ACS Chem Biol8:2501-8 (2013) 
 
Polymerase acidic protein [1-204,T86I,G186S]
Name:Polymerase acidic protein [1-204,T86I,G186S]
Type:Protein
Mol. Mass.:28455.35
Organism:2009 H1N1 Influenza
Description:P13166[1-204,T86I,G186S]
Residue:241
BDBM105201
NameBDBM105201
Synonyms:6-(3-Methoxyphenyl-3-hydroxypyridin-2(1H)-one (Compound 5)
TypeSmall organic molecule
Emp. Form.C12H11NO3
Mol. Mass.217.2206
SMILESCOc1cccc(c1)-c1ccc(O)c(=O)[nH]1