Reaction Details
TargetSodium-dependent serotonin transporter
LigandBDBM105215
Substrate/Competitorn/a
Meas. Tech.In vitro Binding Affinity Assay
pH7.7±n/a
Temperature298.15±n/a K
Ki 16.1±1.2 nM
Commentsextracted
Citation Gabrielsen, MWolosewicz, KZawadzka, AKossakowski, JNowak, GWolak, MStachowicz, KSiwek, ARavna, AWKufareva, IKozerski, LBednarek, ESitkowski, JBocian, WAbagyan, RBojarski, AJSylte, IChilmonczyk, Z Synthesis, antidepressant evaluation and docking studies of long-chain alkylnitroquipazines as serotonin transporter inhibitors. Chem Biol Drug Des81:695-706 (2013) 
 
Sodium-dependent serotonin transporter
Name:Sodium-dependent serotonin transporter
Type:Multi-pass membrane protein
Mol. Mass.:70168.43
Organism:Rattus norvegicus (rat)
Description:P31652
Residue:630
BDBM105215
NameBDBM105215
Synonyms:2-(4-Dodecyl-piperazin-1-yl)-6-nitroquinoline (12)
TypeSmall organic molecule
Emp. Form.C25H38N4O2
Mol. Mass.426.5948
SMILESCCCCCCCCCCCCN1CCN(CC1)c1ccc2cc(ccc2n1)[N+]([O-])=O