Reaction Details
TargetPolyunsaturated fatty acid lipoxygenase ALOX15
LigandBDBM106786
Substrate/Competitorn/a
Meas. Tech.IC50 Assay
pH7.5±0
Temperature296.15±0 K
IC50 2.9e+4±n/a nM
Citation Mascayano, CEspinosa, VSepúlveda-Boza, SSepúlveda-Boza, EKPerry, S In vitro study of isoflavones and isoflavans as potent inhibitors of human 12- and 15-lipoxygenases. Chem Biol Drug Des82:317-25 (2013) 
 
Polyunsaturated fatty acid lipoxygenase ALOX15
Name:Polyunsaturated fatty acid lipoxygenase ALOX15
Type:Protein
Mol. Mass.:74804.05
Organism:Homo sapiens (Human)
Description:n/a
Residue:662
BDBM106786
NameBDBM106786
Synonyms:3‐(4‐chlorophenyl)‐7‐hydroxy‐8‐methyl‐4H‐chromen‐4‐ one | 7-Hydroxy-8-methyl-4′-chloroisoflavan (5a)
TypeSmall organic molecule
Emp. Form.C16H11ClO3
Mol. Mass.286.71
SMILESCc1c(O)ccc2c1occ(-c1ccc(Cl)cc1)c2=O