Reaction Details
TargetPolyunsaturated fatty acid lipoxygenase ALOX15
LigandBDBM106787
Substrate/Competitorn/a
Meas. Tech.IC50 Assay
pH7.5±0
Temperature296.15±0 K
IC50 4.4e+3±n/a nM
Citation Mascayano, CEspinosa, VSepúlveda-Boza, SSepúlveda-Boza, EKPerry, S In vitro study of isoflavones and isoflavans as potent inhibitors of human 12- and 15-lipoxygenases. Chem Biol Drug Des82:317-25 (2013) 
 
Polyunsaturated fatty acid lipoxygenase ALOX15
Name:Polyunsaturated fatty acid lipoxygenase ALOX15
Type:Protein
Mol. Mass.:74804.05
Organism:Homo sapiens (Human)
Description:n/a
Residue:662
BDBM106787
NameBDBM106787
Synonyms:3‐(4‐methylphenyl)‐3,4‐dihydro‐2H‐1‐benzopyran‐7,8‐ diol HIR-303
TypeSmall organic molecule
Emp. Form.C16H16O3
Mol. Mass.256.2964
SMILESCc1ccc(cc1)C1COc2c(C1)ccc(O)c2O