Reaction Details
TargetPolyunsaturated fatty acid lipoxygenase ALOX15B
LigandBDBM106788
Substrate/Competitorn/a
Meas. Tech.IC50 Assay
pH7.5±0
Temperature296.15±0 K
IC50 3.3e+4±n/a nM
Citation Mascayano, CEspinosa, VSepúlveda-Boza, SSepúlveda-Boza, EKPerry, S In vitro study of isoflavones and isoflavans as potent inhibitors of human 12- and 15-lipoxygenases. Chem Biol Drug Des82:317-25 (2013) 
 
Polyunsaturated fatty acid lipoxygenase ALOX15B
Name:Polyunsaturated fatty acid lipoxygenase ALOX15B
Type:Protein
Mol. Mass.:75850.40
Organism:Homo sapiens (Human)
Description:n/a
Residue:676
BDBM106788
NameBDBM106788
Synonyms:3‐(3‐methylphenyl)‐3,4‐dihydro‐2H‐1‐benzopyran‐7,8‐ diol HIR-309
TypeSmall organic molecule
Emp. Form.C16H16O3
Mol. Mass.256.2964
SMILESCc1cccc(c1)C1COc2c(C1)ccc(O)c2O