Reaction Details
TargetPolyunsaturated fatty acid lipoxygenase ALOX15B
LigandBDBM50009001
Substrate/Competitorn/a
Meas. Tech.IC50 Assay
pH7.5±0
Temperature296.15±0 K
IC50 7.1e+4±n/a nM
Citation Mascayano, CEspinosa, VSepúlveda-Boza, SSepúlveda-Boza, EKPerry, S In vitro study of isoflavones and isoflavans as potent inhibitors of human 12- and 15-lipoxygenases. Chem Biol Drug Des82:317-25 (2013) 
 
Polyunsaturated fatty acid lipoxygenase ALOX15B
Name:Polyunsaturated fatty acid lipoxygenase ALOX15B
Type:Protein
Mol. Mass.:75850.40
Organism:Homo sapiens (Human)
Description:n/a
Residue:676
BDBM50009001
NameBDBM50009001
Synonyms:5,6,7-Trihydroxyflavone Baicalein Baicalein, 8 US10252984, Table 2.33
TypeSmall organic molecule
Emp. Form.C15H10O5
Mol. Mass.270.2369
SMILESOc1cc2oc(cc(=O)c2c(O)c1O)-c1ccccc1