Reaction Details
TargetMAP/microtubule affinity-regulating kinase 3
LigandBDBM107107
Substrate/Competitorn/a
Meas. Tech.Homogenous Time-Resolved Fluorescence (HTRF) Assay
IC50 720±0.0 nM
Citation Altman, MDBilodeau, MTLim, JNorthrup, AStanton, MGTaoka, BM Imidazo[1,2-a]pyridines and imidazo[1,2-b]pyridazines as mark inhibitors US Patent US8592425 Publication Date 11/26/2013
 
MAP/microtubule affinity-regulating kinase 3
Name:MAP/microtubule affinity-regulating kinase 3
Type:Protein
Mol. Mass.:84525.94
Organism:Homo sapiens (Human)
Description:P27448
Residue:753
BDBM107107
NameBDBM107107
Synonyms:US8592425, 92
TypeSmall organic molecule
Emp. Form.C17H16ClF2N5OS
Mol. Mass.411.857
SMILESN[C@H]1CCCC(F)(F)C1NC(=O)c1nc(c(Cl)s1)-c1cnc2ccccn12