Reaction Details
TargetMAP/microtubule affinity-regulating kinase 3
LigandBDBM107111
Substrate/Competitorn/a
Meas. Tech.Homogenous Time-Resolved Fluorescence (HTRF) Assay
IC50 140±0.0 nM
Citation Altman, MDBilodeau, MTLim, JNorthrup, AStanton, MGTaoka, BM Imidazo[1,2-a]pyridines and imidazo[1,2-b]pyridazines as mark inhibitors US Patent US8592425 Publication Date 11/26/2013
 
MAP/microtubule affinity-regulating kinase 3
Name:MAP/microtubule affinity-regulating kinase 3
Type:Protein
Mol. Mass.:84525.94
Organism:Homo sapiens (Human)
Description:P27448
Residue:753
BDBM107111
NameBDBM107111
Synonyms:US8592425, 24
TypeSmall organic molecule
Emp. Form.C20H23F2N5OS
Mol. Mass.419.491
SMILESCCc1sc(cc1-c1cnc2cc(C)cnn12)C(=O)NC1[C@H](N)CCCC1(F)F