Reaction Details
Target11-beta-hydroxysteroid dehydrogenase 1
LigandBDBM107475
Substrate/Competitorn/a
Meas. Tech.Biological Assay Example 1
IC50 0.49±0.0 nM
Citation Claremon, DAZhuang, LLeftheris, KTice, CMYe, YSingh, SBHimmelsbach, F Cyclic inhibitors of 11BETA-hydroxysteroid dehydrogenase 1 US Patent US8592410 Publication Date 11/26/2013
 
11-beta-hydroxysteroid dehydrogenase 1
Name:11-beta-hydroxysteroid dehydrogenase 1
Type:Enzyme
Mol. Mass.:32409.16
Organism:Homo sapiens (Human)
Description:P28845
Residue:292
BDBM107475
NameBDBM107475
Synonyms:US8592410, 15
TypeSmall organic molecule
Emp. Form.C29H35N3O4
Mol. Mass.489.6059
SMILESCC(C)n1nc(ccc1=O)-c1ccc(cc1)[C@H](C)N1CC[C@@](CC(C)(C)O)(OC1=O)c1ccccc1