Reaction Details
TargetKynurenine/alpha-aminoadipate aminotransferase, mitochondrial
LigandBDBM107720
Substrate/Competitorn/a
Meas. Tech.Inhibition Spectra Assay
IC50 63.7±0.0 nM
Citation Dounay, ABMcAllister, LParikh, VDRong, SVerhoest, PR KAT II inhibitors US Patent US8598200 Publication Date 12/3/2013
 
Kynurenine/alpha-aminoadipate aminotransferase, mitochondrial
Name:Kynurenine/alpha-aminoadipate aminotransferase, mitochondrial
Type:Enzyme
Mol. Mass.:47353.09
Organism:Homo sapiens (Human)
Description:Q8N5Z0
Residue:425
BDBM107720
NameBDBM107720
Synonyms:CHEMBL2347112 | US8598200, 2
TypeSmall organic molecule
Emp. Form.C14H16N4O2
Mol. Mass.272.3024
SMILESCn1nc(Cc2ccccc2)c2C[C@H](N)C(=O)N(O)c12