Reaction Details
TargetKynurenine/alpha-aminoadipate aminotransferase, mitochondrial
LigandBDBM107722
Substrate/Competitorn/a
Meas. Tech.Inhibition Spectra Assay
IC50 43.7±0.0 nM
Citation Dounay, ABMcAllister, LParikh, VDRong, SVerhoest, PR KAT II inhibitors US Patent US8598200 Publication Date 12/3/2013
 
Kynurenine/alpha-aminoadipate aminotransferase, mitochondrial
Name:Kynurenine/alpha-aminoadipate aminotransferase, mitochondrial
Type:Enzyme
Mol. Mass.:47353.09
Organism:Homo sapiens (Human)
Description:Q8N5Z0
Residue:425
BDBM107722
NameBDBM107722
Synonyms:CHEMBL2347114 | US8933095, 5
TypeSmall organic molecule
Emp. Form.C14H13F3N4O2
Mol. Mass.326.2738
SMILESN[C@H]1Cc2c(N(O)C1=O)c(nn2Cc1ccccc1)C(F)(F)F