Reaction Details
TargetSecreted chorismate mutase
LigandBDBM10304
Substrate/Competitorn/a
Meas. Tech.CM Assay
Temperature310.15±n/a K
IC50 1.96e+3± 4.3e+2 nM
Commentsextracted
Citation Jeankumar, VUAlokam, RSridevi, JPSuryadevara, PMatikonda, SSPeddi, SSahithi, SAlvala, MYogeeswari, PSriram, D Discovery and Structure Optimization of a Series of Isatin Derivatives as Mycobacterium tuberculosis Chorismate Mutase Inhibitors. Chem Biol Drug Des83:498-506 (2014) 
 
Secreted chorismate mutase
Name:Secreted chorismate mutase
Type:Protein
Mol. Mass.:21942.03
Organism:Mycobacterium tuberculosis H37Rv
Description:n/a
Residue:199
BDBM10304
NameBDBM10304
Synonyms:1-methyl-2,3-dihydro-1H-indole-2,3-dione Isatin analog 8 | N‐methylindol‐2,3‐dione (Compound 2)
TypeSmall organic molecule
Emp. Form.C9H7NO2
Mol. Mass.161.1574
SMILESCN1C(=O)C(=O)c2ccccc12