Reaction Details
TargetSecreted chorismate mutase
LigandBDBM108071
Substrate/Competitorn/a
Meas. Tech.CM Assay
Temperature310.15±n/a K
IC50 3.050e+4± 2.60e+3 nM
Commentsextracted
Citation Jeankumar, VUAlokam, RSridevi, JPSuryadevara, PMatikonda, SSPeddi, SSahithi, SAlvala, MYogeeswari, PSriram, D Discovery and Structure Optimization of a Series of Isatin Derivatives as Mycobacterium tuberculosis Chorismate Mutase Inhibitors. Chem Biol Drug Des83:498-506 (2014) 
 
Secreted chorismate mutase
Name:Secreted chorismate mutase
Type:Protein
Mol. Mass.:21942.03
Organism:Mycobacterium tuberculosis H37Rv
Description:n/a
Residue:199
BDBM108071
NameBDBM108071
Synonyms:1‐[(3Z)‐1‐acetyl‐2‐oxoindol‐3‐ylidene]‐3‐ aminothiourea (Compound 11)
TypeSmall organic molecule
Emp. Form.C11H10N4O2S
Mol. Mass.262.288
SMILESCC(=O)n1c(O)c(NC(=S)N=N)c2ccccc12