Reaction Details
TargetPlasma kallikrein
LigandBDBM108105
Substrate/Competitorn/a
Meas. Tech.Inhibition Assay
Ki>200000±n/a nM
Citation Herold, PDaghish, MJelakovic, SLudwig, FReichelt, CSchulze, ASchweinitz, A Trypsin-like serine protease inhibitors, and their preparation and use US Patent US8598206 Publication Date 12/3/2013
 
Plasma kallikrein
Name:Plasma kallikrein
Type:Protein
Mol. Mass.:71391.16
Organism:Homo sapiens (Human)
Description:P03952
Residue:638
BDBM108105
NameBDBM108105
Synonyms:US8598206, Table 6, 14
TypeSmall organic molecule
Emp. Form.C35H52N8O5S
Mol. Mass.696.903
SMILESCNC(=O)N1CCC(CC[C@@H](NS(=O)(=O)Cc2ccccc2)C(=O)N[C@@H](CCC2CCNCC2)C(=O)NCc2ccc(cc2)C(N)=N)CC1