Reaction Details
TargetPlasma kallikrein
LigandBDBM47177
Substrate/Competitorn/a
Meas. Tech.Inhibition Assay
Ki>500000±n/a nM
Citation Herold, PDaghish, MJelakovic, SLudwig, FReichelt, CSchulze, ASchweinitz, A Trypsin-like serine protease inhibitors, and their preparation and use US Patent US8598206 Publication Date 12/3/2013
 
Plasma kallikrein
Name:Plasma kallikrein
Type:Protein
Mol. Mass.:71391.16
Organism:Homo sapiens (Human)
Description:P03952
Residue:638
BDBM47177
NameBDBM47177
Synonyms:BDBM108100 | US8598206, Table 6, 9
Typen/a
Emp. Form.C36H53N7O5S
Mol. Mass.695.915
SMILESCC(=O)N1CCC(CCC[C@@H](NS(=O)(=O)Cc2ccccc2)C(=O)N[C@@H](CCC2CCNCC2)C(=O)NCc2ccc(cc2)C(N)=N)CC1