Reaction Details
TargetVitamin K-dependent protein C
LigandBDBM108110
Substrate/Competitorn/a
Meas. Tech.Inhibition Assay
Ki 555±0.0 nM
Citation Herold, PDaghish, MJelakovic, SLudwig, FReichelt, CSchulze, ASchweinitz, A Trypsin-like serine protease inhibitors, and their preparation and use US Patent US8598206 Publication Date 12/3/2013
 
Vitamin K-dependent protein C
Name:Vitamin K-dependent protein C
Type:Enzyme
Mol. Mass.:52067.73
Organism:Homo sapiens (Human)
Description:n/a
Residue:461
BDBM108110
NameBDBM108110
Synonyms:US8598206, Table 6, 19
TypeSmall organic molecule
Emp. Form.C35H46N6O4S
Mol. Mass.646.843
SMILESNC(=N)c1ccc(CNC(=O)[C@H](CCC2CCNCC2)NC(=O)[C@@H](CCCc2ccccc2)NS(=O)(=O)Cc2ccccc2)cc1