Reaction Details
TargetComplement C1s subcomponent
LigandBDBM108118
Substrate/Competitorn/a
Meas. Tech.Inhibition Assay
Ki>10000±0.0 nM
Citation Herold, PDaghish, MJelakovic, SLudwig, FReichelt, CSchulze, ASchweinitz, A Trypsin-like serine protease inhibitors, and their preparation and use US Patent US8598206 Publication Date 12/3/2013
 
Complement C1s subcomponent
Name:Complement C1s subcomponent
Type:Protein
Mol. Mass.:76657.91
Organism:Homo sapiens (Human)
Description:P09871
Residue:688
BDBM108118
NameBDBM108118
Synonyms:US8598206, Table 6, 1
TypeSmall organic molecule
Emp. Form.C30H42N10O4S
Mol. Mass.638.784
SMILESNC(=N)c1ccc(CNC(=O)[C@H](CCC2CCNCC2)NC(=O)[C@@H](CCCn2cnnn2)NS(=O)(=O)Cc2ccccc2)cc1