Reaction Details
TargetComplement C1s subcomponent
LigandBDBM108107
Substrate/Competitorn/a
Meas. Tech.Inhibition Assay
Ki>10000±0.0 nM
Citation Herold, PDaghish, MJelakovic, SLudwig, FReichelt, CSchulze, ASchweinitz, A Trypsin-like serine protease inhibitors, and their preparation and use US Patent US8598206 Publication Date 12/3/2013
 
Complement C1s subcomponent
Name:Complement C1s subcomponent
Type:Protein
Mol. Mass.:76657.91
Organism:Homo sapiens (Human)
Description:P09871
Residue:688
BDBM108107
NameBDBM108107
Synonyms:US8598206, Table 6, 16
TypeSmall organic molecule
Emp. Form.C35H51N7O6S
Mol. Mass.697.888
SMILESCOC(=O)N1CCC(CC[C@@H](NS(=O)(=O)Cc2ccccc2)C(=O)N[C@@H](CCC2CCNCC2)C(=O)NCc2ccc(cc2)C(N)=N)CC1