Reaction Details
TargetComplement C1r subcomponent
LigandBDBM108095
Substrate/Competitorn/a
Meas. Tech.Inhibition Assay
Ki>20000±0.0 nM
Citation Herold, PDaghish, MJelakovic, SLudwig, FReichelt, CSchulze, ASchweinitz, A Trypsin-like serine protease inhibitors, and their preparation and use US Patent US8598206 Publication Date 12/3/2013
 
Complement C1r subcomponent
Name:Complement C1r subcomponent
Type:Enzyme
Mol. Mass.:80113.65
Organism:Homo sapiens (Human)
Description:P00736
Residue:705
BDBM108095
NameBDBM108095
Synonyms:US8598206, Table 6, 4
TypeSmall organic molecule
Emp. Form.C36H46N6O6S
Mol. Mass.690.852
SMILESNC(=N)c1ccc(CNC(=O)[C@H](CCC2CCNCC2)NC(=O)[C@@H](CCCc2ccccc2)NS(=O)(=O)Cc2cccc(c2)C(O)=O)cc1