Reaction Details
TargetTranscription initiation factor IIA subunit 1
LigandBDBM108096
Substrate/Competitorn/a
Meas. Tech.Inhibition Assay
Ki 8000±0.0 nM
Citation Herold, PDaghish, MJelakovic, SLudwig, FReichelt, CSchulze, ASchweinitz, A Trypsin-like serine protease inhibitors, and their preparation and use US Patent US8598206 Publication Date 12/3/2013
 
Transcription initiation factor IIA subunit 1
Name:Transcription initiation factor IIA subunit 1
Type:Enzyme
Mol. Mass.:41485.12
Organism:Homo sapiens (Human)
Description:P52655
Residue:376
BDBM108096
NameBDBM108096
Synonyms:US8598206, Table 6, 5
TypeSmall organic molecule
Emp. Form.C35H51N7O5S
Mol. Mass.681.888
SMILESCC(=O)N1CCC(CC[C@@H](NS(=O)(=O)Cc2ccccc2)C(=O)N[C@@H](CCC2CCNCC2)C(=O)NCc2ccc(cc2)C(N)=N)CC1