Reaction Details
TargetCoagulation factor XI
LigandBDBM108097
Substrate/Competitorn/a
Meas. Tech.Inhibition Assay
Ki 800±0.0 nM
Citation Herold, PDaghish, MJelakovic, SLudwig, FReichelt, CSchulze, ASchweinitz, A Trypsin-like serine protease inhibitors, and their preparation and use US Patent US8598206 Publication Date 12/3/2013
 
Coagulation factor XI
Name:Coagulation factor XI
Type:Enzyme
Mol. Mass.:70130.58
Organism:Homo sapiens (Human)
Description:P03951
Residue:625
BDBM108097
NameBDBM108097
Synonyms:US8598206, Table 6, 6
TypeSmall organic molecule
Emp. Form.C34H51N7O4S
Mol. Mass.653.878
SMILESNC(=N)c1ccc(CNC(=O)[C@H](CCC2CCNCC2)NC(=O)[C@@H](CCCC2CCNCC2)NS(=O)(=O)Cc2ccccc2)cc1