Reaction Details
TargetCoagulation factor XII
LigandBDBM108116
Substrate/Competitorn/a
Meas. Tech.Inhibition Assay
Ki>10000±0.0 nM
Citation Herold, PDaghish, MJelakovic, SLudwig, FReichelt, CSchulze, ASchweinitz, A Trypsin-like serine protease inhibitors, and their preparation and use US Patent US8598206 Publication Date 12/3/2013
 
Coagulation factor XII
Name:Coagulation factor XII
Type:Enzyme
Mol. Mass.:67810.07
Organism:Homo sapiens (Human)
Description:P00748
Residue:615
BDBM108116
NameBDBM108116
Synonyms:US8598206, Table 6, 3
TypeSmall organic molecule
Emp. Form.C37H48N6O6S
Mol. Mass.704.879
SMILESCOC(=O)c1cccc(CS(=O)(=O)N[C@H](CCCc2ccccc2)C(=O)N[C@@H](CCC2CCNCC2)C(=O)NCc2ccc(cc2)C(N)=N)c1