Reaction Details
TargetFatty-acid amide hydrolase 1 [33-574]
LigandBDBM85507
Substrate/Competitorn/a
IC50 1.62e+5± 4.4e+4 nM
Citation Lambruschini, CVeronesi, MRomeo, EGarau, GBandiera, TPiomelli, DScarpelli, RDalvit, C Development of fragment-based n-FABS NMR screening applied to the membrane enzyme FAAH. Chembiochem14:1611-9 (2013) 
 
Fatty-acid amide hydrolase 1 [33-574]
Name:Fatty-acid amide hydrolase 1 [33-574]
Type:Protein
Mol. Mass.:59459.86
Organism:Rattus norvegicus (Rat)
Description:97-1722bp
Residue:542
BDBM85507
NameBDBM85507
Synonyms:CAS_4394-00-7 Niflumic acid US10278929, Niflumic acid US20240002326, Compound Niflumic acid
TypeSmall organic molecule
Emp. Form.C13H9F3N2O2
Mol. Mass.282.218
SMILESOC(=O)c1cccnc1Nc1cccc(c1)C(F)(F)F