Reaction Details
TargetMetabotropic glutamate receptor 5
LigandBDBM109098
Substrate/Competitorn/a
Meas. Tech.Binding Assay
Temperature298.15±n/a K
Ki 2.6±0.0 nM
Commentsextracted
Citation Cosford, NDSeiders, TJPayne, JERoppe, JRHuang, DSmith, NDPoon, SFKing, CEastman, BWWang, BArruda, JMVernier, JZhao, X Thiazolyl mGluR5 antagonists and methods for their use US Patent US8609852 Publication Date 12/17/2013
 
Metabotropic glutamate receptor 5
Name:Metabotropic glutamate receptor 5
Type:Enzyme
Mol. Mass.:131900.14
Organism:Rattus norvegicus (Rat)
Description:P31424
Residue:1203
BDBM109098
NameBDBM109098
Synonyms:US8609852, 4
TypeSmall organic molecule
Emp. Form.C18H11N3S
Mol. Mass.301.365
SMILESCc1nc(cs1)C#Cc1ccc(nc1)-c1ccccc1C#N