Reaction Details
TargetMetabotropic glutamate receptor 5
LigandBDBM109114
Substrate/Competitorn/a
Meas. Tech.Binding Assay
Temperature298.15±n/a K
Ki 1.5±0.0 nM
Commentsextracted
Citation Cosford, NDSeiders, TJPayne, JERoppe, JRHuang, DSmith, NDPoon, SFKing, CEastman, BWWang, BArruda, JMVernier, JZhao, X Thiazolyl mGluR5 antagonists and methods for their use US Patent US8609852 Publication Date 12/17/2013
 
Metabotropic glutamate receptor 5
Name:Metabotropic glutamate receptor 5
Type:Enzyme
Mol. Mass.:131900.14
Organism:Rattus norvegicus (Rat)
Description:P31424
Residue:1203
BDBM109114
NameBDBM109114
Synonyms:US8609852, 21
TypeSmall organic molecule
Emp. Form.C15H16N4S
Mol. Mass.284.379
SMILESCC1CCCN1c1ncc(cn1)C#Cc1csc(C)n1