Reaction Details
TargetMetabotropic glutamate receptor 5
LigandBDBM109125
Substrate/Competitorn/a
Meas. Tech.Binding Assay
Temperature298.15±n/a K
Ki 4.8±0.0 nM
Commentsextracted
Citation Cosford, NDSeiders, TJPayne, JERoppe, JRHuang, DSmith, NDPoon, SFKing, CEastman, BWWang, BArruda, JMVernier, JZhao, X Thiazolyl mGluR5 antagonists and methods for their use US Patent US8609852 Publication Date 12/17/2013
 
Metabotropic glutamate receptor 5
Name:Metabotropic glutamate receptor 5
Type:Enzyme
Mol. Mass.:131900.14
Organism:Rattus norvegicus (Rat)
Description:P31424
Residue:1203
BDBM109125
NameBDBM109125
Synonyms:US8609852, 32
TypeSmall organic molecule
Emp. Form.C16H17N3S
Mol. Mass.283.391
SMILESCc1nc(cs1)C#Cc1cnc(nc1)C1CCCCC1