Reaction Details
TargetMelanin-concentrating hormone receptor 1
LigandBDBM109802
Substrate/Competitorn/a
Meas. Tech.Binding Assay
Ki 13±0.0 nM
Citation Guzzo, PRSurman, MDHenderson, AJJiang, MX Azinone-substituted azapolycycle MCH-1 antagonists, methods of making, and use thereof US Patent US8618299 Publication Date 12/31/2013
 
Melanin-concentrating hormone receptor 1
Name:Melanin-concentrating hormone receptor 1
Type:G Protein-Coupled Receptor (GPCR)
Mol. Mass.:45976.27
Organism:Homo sapiens (Human)
Description:Membranes from CHO-K1 cells stably expressing human MCH1R were used in assays.
Residue:422
BDBM109802
NameBDBM109802
Synonyms:US8618299, 20
TypeSmall organic molecule
Emp. Form.C27H28N4O2
Mol. Mass.440.5368
SMILESCc1ccc(COc2ccn(-c3ccc4c5C6CCCN6CCc5n(C)c4c3)c(=O)c2)cn1