Reaction Details
TargetMelanin-concentrating hormone receptor 1
LigandBDBM109803
Substrate/Competitorn/a
Meas. Tech.Binding Assay
Ki 8.4±0.0 nM
Citation Guzzo, PRSurman, MDHenderson, AJJiang, MX Azinone-substituted azapolycycle MCH-1 antagonists, methods of making, and use thereof US Patent US8618299 Publication Date 12/31/2013
 
Melanin-concentrating hormone receptor 1
Name:Melanin-concentrating hormone receptor 1
Type:G Protein-Coupled Receptor (GPCR)
Mol. Mass.:45976.27
Organism:Homo sapiens (Human)
Description:Membranes from CHO-K1 cells stably expressing human MCH1R were used in assays.
Residue:422
BDBM109803
NameBDBM109803
Synonyms:US8618299, 21
TypeSmall organic molecule
Emp. Form.C27H27FN4O2
Mol. Mass.458.5273
SMILESCn1c2CCN3CCCCC3c2c2ccc(cc12)-n1ccc(OCc2ccc(F)cn2)cc1=O