Reaction Details
TargetMelanin-concentrating hormone receptor 1
LigandBDBM109811
Substrate/Competitorn/a
Meas. Tech.Binding Assay
Ki 8.5±0.0 nM
Citation Guzzo, PRSurman, MDHenderson, AJJiang, MX Azinone-substituted azapolycycle MCH-1 antagonists, methods of making, and use thereof US Patent US8618299 Publication Date 12/31/2013
 
Melanin-concentrating hormone receptor 1
Name:Melanin-concentrating hormone receptor 1
Type:G Protein-Coupled Receptor (GPCR)
Mol. Mass.:45976.27
Organism:Homo sapiens (Human)
Description:Membranes from CHO-K1 cells stably expressing human MCH1R were used in assays.
Residue:422
BDBM109811
NameBDBM109811
Synonyms:US8618299, 29
TypeSmall organic molecule
Emp. Form.C27H27N3O2
Mol. Mass.425.5222
SMILESO=c1cc(OCc2ccccc2)ccn1-c1ccc2c3CN4CCCCC4Cc3[nH]c2c1