Reaction Details
TargetMelanin-concentrating hormone receptor 1
LigandBDBM109829
Substrate/Competitorn/a
Meas. Tech.Binding Assay
Ki 10±0.0 nM
Citation Guzzo, PRSurman, MDHenderson, AJJiang, MX Azinone-substituted azapolycycle MCH-1 antagonists, methods of making, and use thereof US Patent US8618299 Publication Date 12/31/2013
 
Melanin-concentrating hormone receptor 1
Name:Melanin-concentrating hormone receptor 1
Type:G Protein-Coupled Receptor (GPCR)
Mol. Mass.:45976.27
Organism:Homo sapiens (Human)
Description:Membranes from CHO-K1 cells stably expressing human MCH1R were used in assays.
Residue:422
BDBM109829
NameBDBM109829
Synonyms:US8618299, 47
TypeSmall organic molecule
Emp. Form.C26H24ClFN4O2
Mol. Mass.478.946
SMILESCn1c2CCN3CCCC3c2c2ccc(nc12)-n1ccc(OCc2ccc(Cl)cc2F)cc1=O