Reaction Details
TargetProcathepsin L
LigandBDBM16509
Substrate/Competitorn/a
Meas. Tech.Cathepsin L Inhibition Assay
pH5.5±n/a
Temperature310.15±n/a K
IC50>1.00e+5±n/a nM
Commentsextracted
Citation Baek, KHKarki, RLee, ESNa, YKwon, Y Synthesis and investigation of dihydroxychalcones as calpain and cathepsin inhibitors. Bioorg Chem51:24-30 (2013) 
 
Procathepsin L
Name:Procathepsin L
Type:Enzyme
Mol. Mass.:37557.19
Organism:Homo sapiens (Human)
Description:Purchased from Calbiochem (San Diego, CA).
Residue:333
BDBM16509
NameBDBM16509
Synonyms:(2S)-1-[(2S,3S)-3-methyl-2-{[(2S,3S)-3-(propylcarbamoyl)oxiran-2-yl]formamido}pentanoyl]pyrrolidine-2-carboxylic acid CHEMBL490920 PrNH-tES-Ile-Pro-OH | epoxysuccinyl derivative CA074
TypeSmall organic molecule
Emp. Form.C18H29N3O6
Mol. Mass.383.4394
SMILES[H][C@@]1(O[C@]1([H])C(=O)N[C@@H]([C@@H](C)CC)C(=O)N1CCC[C@H]1C(O)=O)C(=O)NCCC