Reaction Details
TargetProcathepsin L
LigandBDBM110188
Substrate/Competitorn/a
Meas. Tech.Cathepsin L Inhibition Assay
pH5.5±n/a
Temperature310.15±n/a K
IC50>1.00e+5±n/a nM
Commentsextracted
Citation Baek, KHKarki, RLee, ESNa, YKwon, Y Synthesis and investigation of dihydroxychalcones as calpain and cathepsin inhibitors. Bioorg Chem51:24-30 (2013) 
 
Procathepsin L
Name:Procathepsin L
Type:Enzyme
Mol. Mass.:37557.19
Organism:Homo sapiens (Human)
Description:Purchased from Calbiochem (San Diego, CA).
Residue:333
BDBM110188
NameBDBM110188
Synonyms:1-(2,4-Dihydroxyphenyl)-3-(pyridin-2-yl)propenone (8)
TypeSmall organic molecule
Emp. Form.C14H11NO3
Mol. Mass.241.242
SMILESOc1ccc(C(=O)\C=C\c2ccccn2)c(O)c1