Reaction Details
TargetProcathepsin L
LigandBDBM110196
Substrate/Competitorn/a
Meas. Tech.Cathepsin L Inhibition Assay
pH5.5±n/a
Temperature310.15±n/a K
IC50>1.00e+5±n/a nM
Commentsextracted
Citation Baek, KHKarki, RLee, ESNa, YKwon, Y Synthesis and investigation of dihydroxychalcones as calpain and cathepsin inhibitors. Bioorg Chem51:24-30 (2013) 
 
Procathepsin L
Name:Procathepsin L
Type:Enzyme
Mol. Mass.:37557.19
Organism:Homo sapiens (Human)
Description:Purchased from Calbiochem (San Diego, CA).
Residue:333
BDBM110196
NameBDBM110196
Synonyms:1-(3,5-Dihydroxyphenyl)-3-(thiophen-3-yl)propenone (23)
TypeSmall organic molecule
Emp. Form.C13H10O3S
Mol. Mass.246.282
SMILESOc1cc(O)cc(c1)C(=O)\C=C\c1ccsc1