Reaction Details
Target3-phosphoinositide-dependent protein kinase 1 [51-359]
LigandBDBM282376
Substrate/Competitorn/a
Meas. Tech.PDK1 kinase assay
IC50<100±n/a nM
Citation Arndt, JChan, TGuckian, KKumaravel, GLee, WLin, EYScott, DSun, LThomas, Jvan Vloten, KWang, DZhang, LErlanson, D Heterocyclic compounds useful as PDK1 inhibitors US Patent US10030016 Publication Date 7/24/2018
 
3-phosphoinositide-dependent protein kinase 1 [51-359]
Name:3-phosphoinositide-dependent protein kinase 1 [51-359]
Type:Enzyme Catalytic Domain
Mol. Mass.:35302.26
Organism:Homo sapiens (Human)
Description:O15530[51-359]
Residue:309
BDBM282376
NameBDBM282376
Synonyms:N-(3,4-difluorobenzyl)-2- (2-(2-(methylamino)quinazolin- 6-yl)prop-2-ynylamino)-5- (trifluoromethyl)nicotinamide | US10030016, Example 256
TypeSmall organic molecule
Emp. Form.C26H19F5N6O
Mol. Mass.526.4607
SMILESCNc1ncc2cc(ccc2n1)C#CCNc1ncc(cc1C(=O)NCc1ccc(F)c(F)c1)C(F)(F)F