Reaction Details
Target3-phosphoinositide-dependent protein kinase 1 [51-359]
LigandBDBM282377
Substrate/Competitorn/a
Meas. Tech.PDK1 kinase assay
IC50<100±n/a nM
Citation Arndt, JChan, TGuckian, KKumaravel, GLee, WLin, EYScott, DSun, LThomas, Jvan Vloten, KWang, DZhang, LErlanson, D Heterocyclic compounds useful as PDK1 inhibitors US Patent US10030016 Publication Date 7/24/2018
 
3-phosphoinositide-dependent protein kinase 1 [51-359]
Name:3-phosphoinositide-dependent protein kinase 1 [51-359]
Type:Enzyme Catalytic Domain
Mol. Mass.:35302.26
Organism:Homo sapiens (Human)
Description:O15530[51-359]
Residue:309
BDBM282377
NameBDBM282377
Synonyms:(S)-2-(3-(2-aminoquinazolin- 6-yl)prop-2-ynylamino)-5- cyano-N-(1-(4-fluorophenyl) ethyl)nicotinamide | US10030016, Example 257
TypeSmall organic molecule
Emp. Form.C26H20FN7O
Mol. Mass.465.4817
SMILESC[C@H](NC(=O)c1cc(cnc1NCC#Cc1ccc2nc(N)ncc2c1)C#N)c1ccc(F)cc1