Reaction Details
TargetPhosphatidylinositol 4,5-bisphosphate 3-kinase catalytic subunit gamma isoform
LigandBDBM110430
Substrate/Competitorn/a
Meas. Tech.Biological Assay
IC50 21±n/a nM
Citation Gaillard, PPomel, VJeanclaude-Etter, IDorbais, JKlicic, JMontagne, C Quinoxaline inhibitors of phosphoinositide-3-kinases (PI3Ks) US Patent US8614215 Publication Date 12/24/2013
 
Phosphatidylinositol 4,5-bisphosphate 3-kinase catalytic subunit gamma isoform
Name:Phosphatidylinositol 4,5-bisphosphate 3-kinase catalytic subunit gamma isoform
Type:Enzyme Subunit
Mol. Mass.:126470.30
Organism:Homo sapiens (Human)
Description:P48736
Residue:1102
BDBM110430
NameBDBM110430
Synonyms:US8614215, 1
TypeSmall organic molecule
Emp. Form.C21H20N6O5S
Mol. Mass.468.486
SMILESCOC(=O)c1ccc(OC)cc1Nc1nc2ccccc2nc1NS(=O)(=O)c1cn(C)cn1