Reaction Details
TargetPhosphatidylinositol 4,5-bisphosphate 3-kinase catalytic subunit gamma isoform
LigandBDBM110513
Substrate/Competitorn/a
Meas. Tech.Biological Assay
IC50 10±n/a nM
Citation Gaillard, PPomel, VJeanclaude-Etter, IDorbais, JKlicic, JMontagne, C Quinoxaline inhibitors of phosphoinositide-3-kinases (PI3Ks) US Patent US8614215 Publication Date 12/24/2013
 
Phosphatidylinositol 4,5-bisphosphate 3-kinase catalytic subunit gamma isoform
Name:Phosphatidylinositol 4,5-bisphosphate 3-kinase catalytic subunit gamma isoform
Type:Enzyme Subunit
Mol. Mass.:126470.30
Organism:Homo sapiens (Human)
Description:P48736
Residue:1102
BDBM110513
NameBDBM110513
Synonyms:US8614215, 85
TypeSmall organic molecule
Emp. Form.C30H35N5O5S2
Mol. Mass.609.759
SMILESCOc1ccc(CC2CCS(=O)(=O)CC2)c(Nc2nc3ccccc3nc2NS(=O)(=O)c2ccc(CN(C)C)cc2)c1