Reaction Details
TargetHigh affinity cGMP-specific 3',5'-cyclic phosphodiesterase 9A
LigandBDBM111891
Substrate/Competitorn/a
Meas. Tech.Scintillation Proximity Assay
pH7.5±0
Temperature273.15±0 K
IC50 12±0 nM
Citation Giovannini, RDorner-Ciossek, CEickmeier, CFiegen, DFox, TFuchs, KHeine, NRosenbrock, HSchaenzle, G Compounds for the treatment of CNS disorders US Patent US8623901 Publication Date 1/7/2014
 
High affinity cGMP-specific 3',5'-cyclic phosphodiesterase 9A
Name:High affinity cGMP-specific 3',5'-cyclic phosphodiesterase 9A
Type:Protein
Mol. Mass.:68488.40
Organism:Homo sapiens (Human)
Description:O76083
Residue:593
BDBM111891
NameBDBM111891
Synonyms:US8623901, 219
TypeSmall organic molecule
Emp. Form.C22H21N5O2
Mol. Mass.387.4344
SMILESO=c1[nH]c(Cc2ccccc2-c2cccnc2)nc2n(ncc12)C1CCOCC1