Reaction Details
TargetHigh affinity cGMP-specific 3',5'-cyclic phosphodiesterase 9A
LigandBDBM111899
Substrate/Competitorn/a
Meas. Tech.Scintillation Proximity Assay
pH7.5±n/a
Temperature273.15±n/a K
IC50 9±n/a nM
Citation Giovannini, RDorner-Ciossek, CEickmeier, CFiegen, DFox, TFuchs, KHeine, NRosenbrock, HSchaenzle, G Compounds for the treatment of CNS disorders US Patent US8623901 Publication Date 1/7/2014
 
High affinity cGMP-specific 3',5'-cyclic phosphodiesterase 9A
Name:High affinity cGMP-specific 3',5'-cyclic phosphodiesterase 9A
Type:Protein
Mol. Mass.:68488.40
Organism:Homo sapiens (Human)
Description:O76083
Residue:593
BDBM111899
NameBDBM111899
Synonyms:US8623901, 226
TypeSmall organic molecule
Emp. Form.C29H27N5O3
Mol. Mass.493.5564
SMILESO=c1[nH]c(Cc2ccccc2-c2ccc(OCc3ccccc3)nc2)nc2n(ncc12)C1CCOCC1